Target
Non-receptor tyrosine-protein kinase TYK2 [888-1187]
Ligand
BDBM50355501
Substrate
Meas. Tech.
Kinase Assay
pH
7.5±n/a
IC50
6.00±n/a nM
Comments
extracted
Citation
 Bursulaya, BFisch, ALajiness, JPMachauer, RMalekar, SPetrassi, HMRamazani, FRemond, AUllrich, TUsselmann, PVangrevelinghe, E Substituted indazoles for treating tendon and/or ligament injuries US Patent  US10112907 Publication Date 10/30/2018 
Target
Name:
Non-receptor tyrosine-protein kinase TYK2 [888-1187]
Synonyms:
Non-receptor tyrosine-protein kinase TYK2 (aa 888-1187) TYK2 (aa 888-1187) | TYK2_HUMAN
Type:
Protein
Mol. Mass.:
34527.73
Organism:
Homo sapiens (Human)
Description:
P29597[888-1187]
Residue:
300
  
Inhibitor
Name:
BDBM50355501
Synonyms:
INCB-018424 RUXOLITINIB PHOSPHATE US10766894, Compound TABLE 1.1 US11203595, TABLE 1.1 | US11279703, TABLE 6.147
Type:
Small organic molecule
Emp. Form.:
C17H18N6
Mol. Mass.:
306.365
SMILES:
N#CC[C@H](C1CCCC1)n1cc(cn1)-c1ncnc2[nH]ccc12
: