Target
Tyrosine-protein kinase JAK3 [811-1124]
Ligand
BDBM103727
Substrate
Meas. Tech.
Kinase Assay
pH
7.5±n/a
IC50
9400±n/a nM
Comments
extracted
Citation
 Bursulaya, BFisch, ALajiness, JPMachauer, RMalekar, SPetrassi, HMRamazani, FRemond, AUllrich, TUsselmann, PVangrevelinghe, E Substituted indazoles for treating tendon and/or ligament injuries US Patent  US10112907 Publication Date 10/30/2018 
Target
Name:
Tyrosine-protein kinase JAK3 [811-1124]
Synonyms:
JAK3 JAK3_HUMAN | Tyrosine-protein kinase JAK3 (aa 811-1124)
Type:
Protein
Mol. Mass.:
35601.85
Organism:
Homo sapiens (Human)
Description:
P52333[811-1124]
Residue:
314
  
Inhibitor
Name:
BDBM103727
Synonyms:
US10112907, Example 00033 US10708263, Compound 1 US10919890, Compound 1 US11000528, Cpd # 1 US11279699, Compound Filgotinib | US8563545, 1
Type:
Small organic molecule
Emp. Form.:
C21H23N5O3S
Mol. Mass.:
425.504
SMILES:
O=C(Nc1nc2cccc(-c3ccc(CN4CCS(=O)(=O)CC4)cc3)n2n1)C1CC1
: