Target
Tyrosine-protein kinase JAK2 [808-1132]
Ligand
BDBM50021656
Substrate
Meas. Tech.
Kinase Assay
pH
7.5±n/a
IC50
4.00±n/a nM
Comments
extracted
Citation
 Bursulaya, BFisch, ALajiness, JPMachauer, RMalekar, SPetrassi, HMRamazani, FRemond, AUllrich, TUsselmann, PVangrevelinghe, E Substituted indazoles for treating tendon and/or ligament injuries US Patent  US10112907 Publication Date 10/30/2018 
Target
Name:
Tyrosine-protein kinase JAK2 [808-1132]
Synonyms:
JAK2 JAK2_HUMAN | Tyrosine-protein kinase JAK2 JH1 (808-1132)
Type:
Protein
Mol. Mass.:
39171.39
Organism:
Homo sapiens (Human)
Description:
O60674[808-1132]
Residue:
335
  
Inhibitor
Name:
BDBM50021656
Synonyms:
BARICITINIB LY-3009104 US10766894, Compound TABLE 1.19 US11203595, TABLE 1.19 US20230416237, Example baricitinib
Type:
Small organic molecule
Emp. Form.:
C16H17N7O2S
Mol. Mass.:
371.417
SMILES:
CCS(=O)(=O)N1CC(CC#N)(C1)n1cc(cn1)-c1ncnc2[nH]ccc12
: