Target
Fatty acid synthase
Ligand
BDBM269289
Substrate
Meas. Tech.
Inhibition Scintillation Proximity Assay
IC50
417±n/a nM
Citation
 Connolly, PJLu, T Imidazolin-5-one derivative useful as FASN inhibitors for the treatment of cancer US Patent  US10413545 Publication Date 9/17/2019 
Target
Name:
Fatty acid synthase
Synonyms:
FAS FAS_HUMAN HU FASN
Type:
Enzyme
Mol. Mass.:
273419.37
Organism:
Homo sapiens (Human)
Description:
P49327
Residue:
2511
  
Inhibitor
Name:
BDBM269289
Synonyms:
2-(4-(benzo[d]thiazol-2-yl)-2-fluorophenyl)-1-((1-(cyclopropanecarbonyl)azetidin-3-yl)methyl)-4,4-dimethyl-1H-imidazol-5(4H)-one US9718813, Compound 34
Type:
Small organic molecule
Emp. Form.:
C26H25FN4O2S
Mol. Mass.:
476.566
SMILES:
CC1(C)N=C(N(CC2CN(C2)C(=O)C2CC2)C1=O)c1ccc(cc1F)-c1nc2ccccc2s1
: