Target
Beta-secretase 1
Ligand
BDBM143225
Substrate
Meas. Tech.
BACE1 HTRF FRET Assay
pH
5±n/a
Ki
25600±n/a nM
Comments
extracted
Citation
 PubChem, PCScott, JDStamford, AWGilbert, EJCumming, JNIserloh, U Iminothiadiazine dioxide compounds as BACE inhibitors, compositions, and their use US Patent  US9687494 Publication Date 6/27/2017 
Target
Name:
Beta-secretase 1
Synonyms:
ASP2 Aspartyl protease 2 BACE1 Beta-secretase (BACE) Beta-secretase 1 (BACE 1) Beta-secretase 1 (BACE1) Beta-site amyloid precursor protein cleaving enzyme 1 Memapsin-2 beta-Secretase (BACE-1) | beta-Secretase (BACE1)
Type:
Protein
Mol. Mass.:
55755.10
Organism:
Homo sapiens (Human)
Description:
P56817
Residue:
501
  
Inhibitor
Name:
BDBM143225
Synonyms:
US8940748, 45 US9687494, 45
Type:
Small organic molecule
Emp. Form.:
C16H16N4O2S2
Mol. Mass.:
360.454
SMILES:
CN1C(=N)N[C@@](C)(CS1(=O)=O)c1cc(cs1)-c1cccc(c1)C#N
: