Target
Potassium channel subfamily K member 9
Ligand
BDBM413539
Substrate
Meas. Tech.
In Vitro Electrophysiological Assay
IC50
2500±n/a nM
Citation
 Delbeck, MHahn, MMüller, TMeier, HLustig, KMosig, JToschi, LAlbus, UGehring, DRosenstein, B Substituted perhydropyrrolo[3,4-c]pyrrole derivatives and the use of same US Patent  US10414765 Publication Date 9/17/2019 
Target
Name:
Potassium channel subfamily K member 9
Synonyms:
Acid-sensitive potassium channel protein TASK-3 KCNK9_HUMAN TWIK-related acid-sensitive K(+) channel 3 Two pore potassium channel KT3.2
Type:
PROTEIN
Mol. Mass.:
42276.04
Organism:
Homo sapiens (Human)
Description:
ChEMBL_1457494
Residue:
374
  
Inhibitor
Name:
BDBM413539
Synonyms:
US10414765, Example 20
Type:
Small organic molecule
Emp. Form.:
C28H27ClN4O
Mol. Mass.:
470.993
SMILES:
Cc1ccccc1C(=O)N1CC2CN(Cc3c(nc4ccccn34)-c3ccc(Cl)cc3)CC2C1
: