Target
Nuclear receptor ROR-gamma
Ligand
BDBM414294
Substrate
Meas. Tech.
General RORgamma Gal4 Reporter Assay
IC50
3.00±n/a nM
Citation
 Marcoux, DBeaudoin Bertrand, MDhar, TGYang, MGXiao, ZXiao, HZhu, YWeigelt, CABatt, DG Tricyclic sulfones as ROR gamma modulators US Patent  US10435369 Publication Date 10/8/2019 
Target
Name:
Nuclear receptor ROR-gamma
Synonyms:
NR1F3 Nuclear receptor ROR-gamma (RORC) RAR-related orphan receptor C (RORc) RORG RZRG Retinoid-related orphan receptor-gamma (RORc)
Type:
Enzyme Catalytic Domain
Mol. Mass.:
58218.40
Organism:
Homo sapiens (Human)
Description:
P51449
Residue:
518
  
Inhibitor
Name:
BDBM414294
Synonyms:
US10435369, Example 181 | US10435369, Example 182
Type:
Small organic molecule
Emp. Form.:
C28H26F8N2O4S
Mol. Mass.:
638.569
SMILES:
Fc1ccc(cc1)S(=O)(=O)[C@@]12CC[C@@H](NC(=O)C3CCC(=O)NC3)[C@@H]1CCc1cc(ccc21)C(F)(C(F)(F)F)C(F)(F)F
: