Target
Interleukin-6
Ligand
BDBM414420
Substrate
Meas. Tech.
IL-6 Production Inhibitory Action Evaluation Test
IC50
<1.000±n/a nM
Citation
 Kawashima, KYamazaki, YTakaoka, SShii, DOda, TMatsuyama, T [4-(1,3,3-trimethyl-2-oxo-3,4-dihydro-1H-quinoxalin-7-yl)phenoxy]ethyloxy compound or salt thereof US Patent  US10435379 Publication Date 10/8/2019 
Target
Name:
Interleukin-6
Synonyms:
B-cell stimulatory factor 2 CDF Hybridoma growth factor IFNB2 IL6 Interferon beta-2
Type:
Mol. Mass.:
23717.96
Organism:
Homo sapiens (Human)
Description:
P05231
Residue:
212
  
Inhibitor
Name:
BDBM414420
Synonyms:
(R)-7-[4-(2-ethoxycarbonyl-2-hydroxyethyl)oxy-2-methoxyphenyl]-8-(5-fluoro-2-methylphenoxymethyl)-1,3,3-trimethyl-3,4-dihydro-1H-quinoxalin-2-one | US10435379, Compound 1-6
Type:
Small organic molecule
Emp. Form.:
C31H35FN2O7
Mol. Mass.:
566.6172
SMILES:
CCOC(=O)[C@@H](O)COc1ccc(c(OC)c1)-c1ccc2NC(C)(C)C(=O)N(C)c2c1COc1cc(F)ccc1C
: