Target
Interleukin-6
Ligand
BDBM331844
Substrate
Meas. Tech.
IL-6 Production Inhibitory Action Evaluation Test
IC50
93.0±n/a nM
Citation
 Kawashima, KYamazaki, YTakaoka, SShii, DOda, TMatsuyama, T [4-(1,3,3-trimethyl-2-oxo-3,4-dihydro-1H-quinoxalin-7-yl)phenoxy]ethyloxy compound or salt thereof US Patent  US10435379 Publication Date 10/8/2019 
Target
Name:
Interleukin-6
Synonyms:
B-cell stimulatory factor 2 CDF Hybridoma growth factor IFNB2 IL6 Interferon beta-2
Type:
Mol. Mass.:
23717.96
Organism:
Homo sapiens (Human)
Description:
P05231
Residue:
212
  
Inhibitor
Name:
BDBM331844
Synonyms:
8-(5-fluoro-2-methylphenoxymethyl)-7-(5-hydroxy-2-methoxyphenyl)-1,3,3-trimethyl-3,4-dihydro-1H-quinoxalin-2-one US10435379, Compound Control C
Type:
Small organic molecule
Emp. Form.:
C26H27FN2O4
Mol. Mass.:
450.502
SMILES:
COc1ccc(O)cc1-c1ccc2NC(C)(C)C(=O)N(C)c2c1COc1cc(F)ccc1C
: