Target
N-formyl peptide receptor 2
Ligand
BDBM350560
Substrate
Meas. Tech.
FLIPR
EC50
1.70±n/a nM
Citation
 Viswanath, VBeard, RLDonello, JEHsia, E Use of agonists of formyl peptide receptor 2 for treating dermatological diseases US Patent  US10434112 Publication Date 10/8/2019 
Target
Name:
N-formyl peptide receptor 2
Synonyms:
ALXR, FPRL1, FPR2 FPR2 FPRH1 Formyl Peptide Receptor-Like 1 LXA4 receptor Lipoxin A4 receptor RFP | hFPRL
Type:
G Protein-Coupled Receptor (GPCR)
Mol. Mass.:
38968.35
Organism:
Homo sapiens (Human)
Description:
P25090
Residue:
351
  
Inhibitor
Name:
BDBM350560
Synonyms:
3-[(4- iodophenyl)carbamoyl]-7,7- dimethylbicyclo[2.2.1]heptane- 2-carboxylic acid US10434112, Compound 22 | US10799518, Compound 22
Type:
Small organic molecule
Emp. Form.:
C17H20INO3
Mol. Mass.:
413.2501
SMILES:
CC1(C)C2CCC1C(C2C(O)=O)C(=O)Nc1ccc(I)cc1
: