Target
Phosphatidylinositol 3-kinase regulatory subunit alpha
Ligand
BDBM295136
Substrate
Meas. Tech.
Kinase Glo Luminescent Kinase Assay (Kglo) for PI 3-Kinase Alpha (A), PI 3-Kinase Beta (B), Vps34 (C), PI 4-Kinase Beta (D)
pH
7.5±n/a
Temperature
298.15±n/a K
IC50
130±n/a nM
Comments
extracted
Citation
 Bellenie, BRBloomfield, GCBruce, ICulshaw, AJHall, ECHollingworth, GJNeef, JSpendiff, MWatson, SJ Amino pyridine derivatives as phosphatidylinositol 3-kinase inhibitors US Patent  US10112926 Publication Date 10/30/2018 
Target
Name:
Phosphatidylinositol 3-kinase regulatory subunit alpha
Synonyms:
GRB1 PI3-kinase class I PI3-kinase p85-alpha subunit PI3-kinase subunit p85-alpha PIK3CG/PIK3R1 Phosphatidylinositol 3-kinase 85 kDa regulatory subunit alpha (PI3K alpha) Phosphatidylinositol 3-kinase regulatory subunit alpha (PIK3R1) Phosphatidylinositol 3-kinase regulatory subunit alpha isoform 1 (PI3 Kinase alpha) Phosphatidylinositol 4,5-bisphosphate 3-kinase catalytic subunit alpha isoform (PI3Kalpha) PtdIns-3-kinase p85-alpha p85 alpha
Type:
Protein
Mol. Mass.:
83592.82
Organism:
Homo sapiens (Human)
Description:
P27986
Residue:
724
  
Inhibitor
Name:
BDBM295136
Synonyms:
3-(6-Amino-5-(3-methylisoxazol-5-yl)pyridin-3-yl)-N-((1-(hydroxymethyl)cyclopentyl) methyl)-4-methylbenzenesulfonamide | US10112926, Example 37.23
Type:
Small organic molecule
Emp. Form.:
C23H28N4O4S
Mol. Mass.:
456.558
SMILES:
Cc1cc(on1)-c1cc(cnc1N)-c1cc(ccc1C)S(=O)(=O)NCC1(CO)CCCC1
: