Target
Orexin receptor type 2
Ligand
BDBM414492
Substrate
Meas. Tech.
FLIPR Ca2+ Flux Assay
IC50
491±n/a nM
Citation
 Kuduk, SDLiverton, NLuo, Y Oxazole orexin receptor antagonists US Patent  US10435398 Publication Date 10/8/2019 
Target
Name:
Orexin receptor type 2
Synonyms:
HCRTR2 OX2R_HUMAN Orexin receptor type 2 (OR-2) Orexin receptor type 2 (OX2R) Ox-2-R | Ox2-R
Type:
Protein
Mol. Mass.:
50710.53
Organism:
Homo sapiens (Human)
Description:
O43614
Residue:
444
  
Inhibitor
Name:
BDBM414492
Synonyms:
N-ethyl-N-{2-[4-(1- hydroxy-1- methylethyl)-5- methyl-1,3-oxazol- 2-yl]ethyl}-2-(2H- tetrazol-2- yl)benzamide | US10435398, Example 9
Type:
Small organic molecule
Emp. Form.:
C19H24N6O3
Mol. Mass.:
384.4323
SMILES:
CCN(CCc1nc(c(C)o1)C(C)(C)O)C(=O)c1ccccc1-n1ncnn1
: