Target
Orexin receptor type 2
Ligand
BDBM414496
Substrate
Meas. Tech.
FLIPR Ca2+ Flux Assay
IC50
435±n/a nM
Citation
 Kuduk, SDLiverton, NLuo, Y Oxazole orexin receptor antagonists US Patent  US10435398 Publication Date 10/8/2019 
Target
Name:
Orexin receptor type 2
Synonyms:
HCRTR2 OX2R_HUMAN Orexin receptor type 2 (OR-2) Orexin receptor type 2 (OX2R) Ox-2-R | Ox2-R
Type:
Protein
Mol. Mass.:
50710.53
Organism:
Homo sapiens (Human)
Description:
O43614
Residue:
444
  
Inhibitor
Name:
BDBM414496
Synonyms:
N-ethyl-N-{2-[4-(1- hydroxy-1- methylethyl)-5- methyl-1,3-oxazol- 2-yl]ethyl}-3-(2H- 1,2,3-triazol-2- yl)thiophene-2- carboxamide | US10435398, Example 10d
Type:
Small organic molecule
Emp. Form.:
C18H23N5O3S
Mol. Mass.:
389.472
SMILES:
CCN(CCc1nc(c(C)o1)C(C)(C)O)C(=O)c1sccc1-n1nccn1
: