Target
Orexin/Hypocretin receptor type 1
Ligand
BDBM414497
Substrate
Meas. Tech.
FLIPR Ca2+ Flux Assay
IC50
2590±n/a nM
Citation
 Kuduk, SDLiverton, NLuo, Y Oxazole orexin receptor antagonists US Patent  US10435398 Publication Date 10/8/2019 
Target
Name:
Orexin/Hypocretin receptor type 1
Synonyms:
HCRTR1 OX1R_HUMAN Orexin receptor type 1 (OR 1) Orexin receptor type 1 (OX1) Orexin receptor type 1 (OxR1) | Ox1r
Type:
Protein
Mol. Mass.:
47554.50
Organism:
Homo sapiens (Human)
Description:
O43613
Residue:
425
  
Inhibitor
Name:
BDBM414497
Synonyms:
N-Ethyl-N-{2-[4-(1-hydroxy-1-methylethyl)-5-methyl-1,3-oxazol-2-yl]ethyl}-2-(2H-1,2,3-triazol-2-yl)benzamide US10435398, Example 25
Type:
Small organic molecule
Emp. Form.:
C20H25N5O3
Mol. Mass.:
383.4442
SMILES:
CCN(CCc1nc(c(C)o1)C(C)(C)O)C(=O)c1ccccc1-n1nccn1
: