Target
Mitogen-activated protein kinase kinase kinase kinase 1
Ligand
BDBM414591
Substrate
Meas. Tech.
HPK1 Kinase Binding Assay
Ki
<100±n/a nM
Citation
 Vechorkin, OLiu, KSokolsky, AWang, AYe, HFYe, QYao, W Pyrazolopyridine compounds and uses thereof US Patent  US10435405 Publication Date 10/8/2019 
Target
Name:
Mitogen-activated protein kinase kinase kinase kinase 1
Synonyms:
HPK1 MAP4K1
Type:
PROTEIN
Mol. Mass.:
91316.07
Organism:
Homo sapiens (Human)
Description:
ChEMBL_586597
Residue:
833
  
Inhibitor
Name:
BDBM414591
Synonyms:
US10435405, Example 9 | US10934288, Example 9
Type:
Small organic molecule
Emp. Form.:
C21H17FN4O3
Mol. Mass.:
392.3831
SMILES:
COc1cccc(c1)C(=O)Nc1n[nH]c2cnc(cc12)-c1c(F)cccc1OC
: