Target
Mitogen-activated protein kinase kinase kinase kinase 1
Ligand
BDBM414592
Substrate
Meas. Tech.
HPK1 Kinase Binding Assay
Ki
<100±n/a nM
Citation
 Vechorkin, OLiu, KSokolsky, AWang, AYe, HFYe, QYao, W Pyrazolopyridine compounds and uses thereof US Patent  US10435405 Publication Date 10/8/2019 
Target
Name:
Mitogen-activated protein kinase kinase kinase kinase 1
Synonyms:
HPK1 MAP4K1
Type:
PROTEIN
Mol. Mass.:
91316.07
Organism:
Homo sapiens (Human)
Description:
ChEMBL_586597
Residue:
833
  
Inhibitor
Name:
BDBM414592
Synonyms:
US10435405, Example 10 | US10934288, Example 10
Type:
Small organic molecule
Emp. Form.:
C21H16F2N4O2
Mol. Mass.:
394.3741
SMILES:
COc1cccc(F)c1-c1cc2c(NC(=O)c3ccc(F)c(C)c3)n[nH]c2cn1
: