Target
Mitogen-activated protein kinase kinase kinase kinase 1
Ligand
BDBM414607
Substrate
Meas. Tech.
HPK1 Kinase Binding Assay
Ki
<100±n/a nM
Citation
 Vechorkin, OLiu, KSokolsky, AWang, AYe, HFYe, QYao, W Pyrazolopyridine compounds and uses thereof US Patent  US10435405 Publication Date 10/8/2019 
Target
Name:
Mitogen-activated protein kinase kinase kinase kinase 1
Synonyms:
HPK1 MAP4K1
Type:
PROTEIN
Mol. Mass.:
91316.07
Organism:
Homo sapiens (Human)
Description:
ChEMBL_586597
Residue:
833
  
Inhibitor
Name:
BDBM414607
Synonyms:
US10435405, Example 25 | US10934288, Example 25
Type:
Small organic molecule
Emp. Form.:
C24H21FN6O3
Mol. Mass.:
460.4603
SMILES:
COc1cccc(F)c1-c1cc2c(NC(=O)c3ccc(cc3)N3CCNC(=O)C3)n[nH]c2cn1
: