Target
Mitogen-activated protein kinase kinase kinase kinase 1
Ligand
BDBM414633
Substrate
Meas. Tech.
HPK1 Kinase Binding Assay
Ki
<100±n/a nM
Citation
 Vechorkin, OLiu, KSokolsky, AWang, AYe, HFYe, QYao, W Pyrazolopyridine compounds and uses thereof US Patent  US10435405 Publication Date 10/8/2019 
Target
Name:
Mitogen-activated protein kinase kinase kinase kinase 1
Synonyms:
HPK1 MAP4K1
Type:
PROTEIN
Mol. Mass.:
91316.07
Organism:
Homo sapiens (Human)
Description:
ChEMBL_586597
Residue:
833
  
Inhibitor
Name:
BDBM414633
Synonyms:
US10435405, Example 50 | US10934288, Example 50
Type:
Small organic molecule
Emp. Form.:
C24H21ClF3N5
Mol. Mass.:
471.905
SMILES:
CN1CCN(CC1)c1ccc(cc1)-c1n[nH]c2cnc(cc12)-c1c(Cl)cccc1C(F)(F)F
: