Target
Mu-type opioid receptor
Ligand
BDBM414827
Substrate
Meas. Tech.
mu-Opioid Receptor Binding Assay
Ki
2.34±0.27 nM
Citation
 Kassick, ATadesse, DTafesse, L 6,7-cyclicmorphinan derivatives and use thereof US Patent  US10435406 Publication Date 10/8/2019 
Target
Name:
Mu-type opioid receptor
Synonyms:
M-OR-1 MOR-1 MUOR1 Mu opiate receptor OPRM1 hMOP | mu-type opioid receptor isoform MOR-1
Type:
G Protein-Coupled Receptor (GPCR)
Mol. Mass.:
44789.51
Organism:
Homo sapiens (Human)
Description:
P35372
Residue:
400
  
Inhibitor
Name:
BDBM414827
Synonyms:
(6R,6aS,11aR)-14-(cyclopropyl-methyl)- 2,6a-dihydroxy-5,6,6a,7,10a,11- hexahydro-6,11a-(epiminoethano)- naphtho[2,1-f]indol-9(10H)-one | US10435406, Compound 9
Type:
Small organic molecule
Emp. Form.:
C22H26N2O3
Mol. Mass.:
366.4534
SMILES:
Oc1ccc2C[C@H]3N(CC4CC4)CC[C@@]4(CC5NC(=O)C=C5C[C@@]34O)c2c1
: