Target
Epithelial discoidin domain-containing receptor 1
Ligand
BDBM372118
Substrate
Meas. Tech.
In Vitro Binding Assay for DDR1
IC50
208±n/a nM
Citation
 Buettelmann, BKocer, BKuhn, BPrunotto, MRichter, HRitter, MRudolph, MSatz, AL Triaza-spirodecanones as DDR1 inhibitors US Patent  US10435407 Publication Date 10/8/2019 
Target
Name:
Epithelial discoidin domain-containing receptor 1
Synonyms:
CAK DDR1_HUMAN Discoidin domain-containing receptor 1 (DDR1) EDDR1 Epithelial discoidin domain receptor 1 (DDR1) Epithelial discoidin domain-containing receptor 1 (DDR1) Mammary carcinoma kinase 10 NTRK4 Protein-tyrosine kinase RTK 6 TRKE | Tyrosine-protein kinase CAK
Type:
Tyrosine-protein kinase
Mol. Mass.:
101130.02
Organism:
Homo sapiens (Human)
Description:
Q08345
Residue:
913
  
Inhibitor
Name:
BDBM372118
Synonyms:
2-[4-Oxo-1-phenyl-8-(1H-pyrazolo[3,4-b]pyridine-5-carbonyl)-1,3,8-triazaspiro[4.5]decan-3-yl]-N-[1-(2,2,2-trifluoroethyl)pyrazol-3-yl]acetamide US10435407, Example 141
Type:
Small organic molecule
Emp. Form.:
C27H26F3N9O3
Mol. Mass.:
581.549
SMILES:
FC(F)(F)Cn1ccc(NC(=O)CN2CN(c3ccccc3)C3(CCN(CC3)C(=O)c3cnc4[nH]ncc4c3)C2=O)n1
: