Target
Histone deacetylase 3
Ligand
BDBM414890
Substrate
Meas. Tech.
Enzyme Inhibition
IC50
<1000±n/a nM
Citation
 Jacques, VRusche, JR HDAC inhibitors US Patent  US10428028 Publication Date 10/1/2019 
Target
Name:
Histone deacetylase 3
Synonyms:
HD3 HDAC3_HUMAN Human HDAC3 SMAP45
Type:
Enzyme
Mol. Mass.:
48829.55
Organism:
Homo sapiens (Human)
Description:
O15379
Residue:
428
  
Inhibitor
Name:
BDBM414890
Synonyms:
US10428028, Coding A6
Type:
Small organic molecule
Emp. Form.:
C20H16FN5O
Mol. Mass.:
361.3723
SMILES:
Nc1cc(F)ccc1NC(=O)c1ccc2n(Cc3cccnc3)ncc2c1
: