Target
Isocitrate dehydrogenase [NADP] cytoplasmic [R132H]
Ligand
BDBM390451
Substrate
Meas. Tech.
Biochemical Assay
IC50
20.0±n/a nM
Citation
 Rehwinkel, HPanknin, ORing, SAnlauf, SSiebeneicher, HNguyen, DSchwede, WBauser, MZimmermann, KKaulfuss, SNeuhaus, RBlaney, PM Benzimidazol-2-amines as mIDH1 inhibitors US Patent  US10442772 Publication Date 10/15/2019 
Target
Name:
Isocitrate dehydrogenase [NADP] cytoplasmic [R132H]
Synonyms:
Cytosolic NADP-isocitrate dehydrogenase (IDH1)(R132H) IDH1 R132H IDHC_HUMAN Isocitrate dehydrogenase 1 mutant (R132H) Isocitrate dehydrogenase [NADP] cytoplasmic (IDH1)(R132H) PICD
Type:
Protein
Mol. Mass.:
46641.74
Organism:
Homo sapiens (Human)
Description:
Human IDH1 R132H (SEQ ID No. 2 in patent). First three are removed. Google patent parsed wrong.
Residue:
414
  
Inhibitor
Name:
BDBM390451
Synonyms:
(�) 3-(2-{[4-(trifluoromethoxy)phenyl]amino}-1-[(cis)-3,3,5-trimethylcyclohexyl]-1H-benzimidazol-5-yl)propanoic acid US9957235, 2-118
Type:
Small organic molecule
Emp. Form.:
C26H30F3N3O3
Mol. Mass.:
489.5299
SMILES:
C[C@@H]1C[C@@H](CC(C)(C)C1)n1c(Nc2ccc(OC(F)(F)F)cc2)nc2cc(CCC(O)=O)ccc12
: