Target
Isocitrate dehydrogenase [NADP] cytoplasmic [R132H]
Ligand
BDBM390543
Substrate
Meas. Tech.
Biochemical Assay
IC50
9.00±n/a nM
Citation
 Rehwinkel, HPanknin, ORing, SAnlauf, SSiebeneicher, HNguyen, DSchwede, WBauser, MZimmermann, KKaulfuss, SNeuhaus, RBlaney, PM Benzimidazol-2-amines as mIDH1 inhibitors US Patent  US10442772 Publication Date 10/15/2019 
Target
Name:
Isocitrate dehydrogenase [NADP] cytoplasmic [R132H]
Synonyms:
Cytosolic NADP-isocitrate dehydrogenase (IDH1)(R132H) IDH1 R132H IDHC_HUMAN Isocitrate dehydrogenase 1 mutant (R132H) Isocitrate dehydrogenase [NADP] cytoplasmic (IDH1)(R132H) PICD
Type:
Protein
Mol. Mass.:
46641.74
Organism:
Homo sapiens (Human)
Description:
Human IDH1 R132H (SEQ ID No. 2 in patent). First three are removed. Google patent parsed wrong.
Residue:
414
  
Inhibitor
Name:
BDBM390543
Synonyms:
US10442772, Example 2-170-2 US9957235, 2-177-1 | US9957235, 2-177-2
Type:
Small organic molecule
Emp. Form.:
C29H39N3O3
Mol. Mass.:
477.6383
SMILES:
COc1cc2n([C@H]3C[C@@H](C)CC(C)(C)C3)c(Nc3ccc(cc3)C(C)C)nc2cc1CCC(O)=O
: