Target
Isocitrate dehydrogenase [NADP] cytoplasmic [R132H]
Ligand
BDBM415877
Substrate
Meas. Tech.
Biochemical Assay
IC50
30.0±n/a nM
Citation
 Rehwinkel, HPanknin, ORing, SAnlauf, SSiebeneicher, HNguyen, DSchwede, WBauser, MZimmermann, KKaulfuss, SNeuhaus, RBlaney, PM Benzimidazol-2-amines as mIDH1 inhibitors US Patent  US10442772 Publication Date 10/15/2019 
Target
Name:
Isocitrate dehydrogenase [NADP] cytoplasmic [R132H]
Synonyms:
Cytosolic NADP-isocitrate dehydrogenase (IDH1)(R132H) IDH1 R132H IDHC_HUMAN Isocitrate dehydrogenase 1 mutant (R132H) Isocitrate dehydrogenase [NADP] cytoplasmic (IDH1)(R132H) PICD
Type:
Protein
Mol. Mass.:
46641.74
Organism:
Homo sapiens (Human)
Description:
Human IDH1 R132H (SEQ ID No. 2 in patent). First three are removed. Google patent parsed wrong.
Residue:
414
  
Inhibitor
Name:
BDBM415877
Synonyms:
US10442772, Example 2-213 | US10442772, Example 2-213-1
Type:
Small organic molecule
Emp. Form.:
C29H39N3O3
Mol. Mass.:
477.6383
SMILES:
COC(=O)Cc1cc2nc(Nc3ccc(cc3)C(C)C)n([C@@H]3C[C@H](C)CC(C)(C)C3)c2cc1OC
: