Target
Isocitrate dehydrogenase [NADP] cytoplasmic [R132H]
Ligand
BDBM390672
Substrate
Meas. Tech.
Biochemical Assay
IC50
20.0±n/a nM
Citation
 Rehwinkel, HPanknin, ORing, SAnlauf, SSiebeneicher, HNguyen, DSchwede, WBauser, MZimmermann, KKaulfuss, SNeuhaus, RBlaney, PM Benzimidazol-2-amines as mIDH1 inhibitors US Patent  US10442772 Publication Date 10/15/2019 
Target
Name:
Isocitrate dehydrogenase [NADP] cytoplasmic [R132H]
Synonyms:
Cytosolic NADP-isocitrate dehydrogenase (IDH1)(R132H) IDH1 R132H IDHC_HUMAN Isocitrate dehydrogenase 1 mutant (R132H) Isocitrate dehydrogenase [NADP] cytoplasmic (IDH1)(R132H) PICD
Type:
Protein
Mol. Mass.:
46641.74
Organism:
Homo sapiens (Human)
Description:
Human IDH1 R132H (SEQ ID No. 2 in patent). First three are removed. Google patent parsed wrong.
Residue:
414
  
Inhibitor
Name:
BDBM390672
Synonyms:
3-[4-fluoro-1-(3,3,5,5-tetramethylcyclohexyl)-2-{[4-(trifluoromethoxy)phenyl]amino}-1H-benzimidazol-5-yl]propanoic acid US9957235, 2-254
Type:
Small organic molecule
Emp. Form.:
C27H31F4N3O3
Mol. Mass.:
521.547
SMILES:
CC1(C)CC(CC(C)(C)C1)n1c(Nc2ccc(OC(F)(F)F)cc2)nc2c(F)c(CCC(O)=O)ccc12
: