Target
Nuclear receptor ROR-gamma
Ligand
BDBM416427
Substrate
Meas. Tech.
Radio-Ligand RORgamma Binding Assay (Assay 1)
Ki
<100±n/a nM
Citation
 Claremon, DADillard, LWFan, YLotesta, SDSingh, SBTice, CMZhao, WZhuang, L Substituted indoles as modulators of ROR-gamma US Patent  US10301261 Publication Date 5/28/2019 
Target
Name:
Nuclear receptor ROR-gamma
Synonyms:
NR1F3 Nuclear receptor ROR-gamma (RORC) RAR-related orphan receptor C (RORc) RORG RZRG Retinoid-related orphan receptor-gamma (RORc)
Type:
Enzyme Catalytic Domain
Mol. Mass.:
58218.40
Organism:
Homo sapiens (Human)
Description:
P51449
Residue:
518
  
Inhibitor
Name:
BDBM416427
Synonyms:
(R)-1-cyclopropyl-N-(1-(4-(ethylsulfonyl)phenyl)-2-hydroxyethyl)-2-((4-(trifluoromethyl)piperidin-1-yl)methyl)-1H-indole-5-carboxamide | US10301261, Compound IN-13
Type:
Small organic molecule
Emp. Form.:
C29H34F3N3O4S
Mol. Mass.:
577.658
SMILES:
CCS(=O)(=O)c1ccc(cc1)[C@H](CO)NC(=O)c1ccc2n(C3CC3)c(CN3CCC(CC3)C(F)(F)F)cc2c1
: