Target
Nuclear receptor ROR-gamma
Ligand
BDBM416434
Substrate
Meas. Tech.
Radio-Ligand RORgamma Binding Assay (Assay 1)
Ki
<100±n/a nM
Citation
 Claremon, DADillard, LWFan, YLotesta, SDSingh, SBTice, CMZhao, WZhuang, L Substituted indoles as modulators of ROR-gamma US Patent  US10301261 Publication Date 5/28/2019 
Target
Name:
Nuclear receptor ROR-gamma
Synonyms:
NR1F3 Nuclear receptor ROR-gamma (RORC) RAR-related orphan receptor C (RORc) RORG RZRG Retinoid-related orphan receptor-gamma (RORc)
Type:
Enzyme Catalytic Domain
Mol. Mass.:
58218.40
Organism:
Homo sapiens (Human)
Description:
P51449
Residue:
518
  
Inhibitor
Name:
BDBM416434
Synonyms:
1-ethyl-N-(4-(ethylsulfonyl)benzyl)-2-(((1r,4r)-4-(trifluoromethyl)cyclohexyl)methyl)-1H-indole-5-carboxamide1-ethyl-N-(4-(ethylsulfonyl)benzyl)-2-(((1s,4s)-4-(trifluoromethyl)cyclohexyl)methyl)-1H-indole-5-carboxamide US10301261, Compound IN-17.2 | US10829448, Compound IN-17.2
Type:
Small organic molecule
Emp. Form.:
C28H33F3N2O3S
Mol. Mass.:
534.633
SMILES:
CCn1c(C[C@H]2CC[C@@H](CC2)C(F)(F)F)cc2cc(ccc12)C(=O)NCc1ccc(cc1)S(=O)(=O)CC
: