Target
Nuclear receptor ROR-gamma
Ligand
BDBM416447
Substrate
Meas. Tech.
Radio-Ligand RORgamma Binding Assay (Assay 1)
Ki
<100±n/a nM
Citation
 Claremon, DADillard, LWFan, YLotesta, SDSingh, SBTice, CMZhao, WZhuang, L Substituted indoles as modulators of ROR-gamma US Patent  US10301261 Publication Date 5/28/2019 
Target
Name:
Nuclear receptor ROR-gamma
Synonyms:
NR1F3 Nuclear receptor ROR-gamma (RORC) RAR-related orphan receptor C (RORc) RORG RZRG Retinoid-related orphan receptor-gamma (RORc)
Type:
Enzyme Catalytic Domain
Mol. Mass.:
58218.40
Organism:
Homo sapiens (Human)
Description:
P51449
Residue:
518
  
Inhibitor
Name:
BDBM416447
Synonyms:
1-cyclopropyl-N-(4-(ethylsulfonyl)benzyl)-2-(((1r,4r)-4-(trifluoromethyl)cyclohexyl)oxy)-1H-benzo[d]imidazole-5-carboxamide | US10301261, Compound BE-3
Type:
Small organic molecule
Emp. Form.:
C27H30F3N3O4S
Mol. Mass.:
549.605
SMILES:
CCS(=O)(=O)c1ccc(CNC(=O)c2ccc3n(C4CC4)c(O[C@H]4CC[C@@H](CC4)C(F)(F)F)nc3c2)cc1
: