Target
Nuclear receptor ROR-gamma
Ligand
BDBM416453
Substrate
Meas. Tech.
Radio-Ligand RORgamma Binding Assay (Assay 1)
Ki
<100±n/a nM
Citation
 Claremon, DADillard, LWFan, YLotesta, SDSingh, SBTice, CMZhao, WZhuang, L Substituted indoles as modulators of ROR-gamma US Patent  US10301261 Publication Date 5/28/2019 
Target
Name:
Nuclear receptor ROR-gamma
Synonyms:
NR1F3 Nuclear receptor ROR-gamma (RORC) RAR-related orphan receptor C (RORc) RORG RZRG Retinoid-related orphan receptor-gamma (RORc)
Type:
Enzyme Catalytic Domain
Mol. Mass.:
58218.40
Organism:
Homo sapiens (Human)
Description:
P51449
Residue:
518
  
Inhibitor
Name:
BDBM416453
Synonyms:
(R)-1-ethyl-N-(1-(4-(ethylsulfonyl)phenyl)-2-hydroxyethyl)-2-(4-(trifluoromethyl)phenoxy)-1H-benzo[d]imidazole-5-carboxamide US10829448, Compound BE-8
Type:
Small organic molecule
Emp. Form.:
C27H26F3N3O5S
Mol. Mass.:
561.573
SMILES:
CCn1c(Oc2ccc(cc2)C(F)(F)F)nc2cc(ccc12)C(=O)N[C@@H](CO)c1ccc(cc1)S(=O)(=O)CC
: