Target
Nuclear receptor ROR-gamma
Ligand
BDBM416456
Substrate
Meas. Tech.
Radio-Ligand RORgamma Binding Assay (Assay 1)
Ki
<100±n/a nM
Citation
 Claremon, DADillard, LWFan, YLotesta, SDSingh, SBTice, CMZhao, WZhuang, L Substituted indoles as modulators of ROR-gamma US Patent  US10301261 Publication Date 5/28/2019 
Target
Name:
Nuclear receptor ROR-gamma
Synonyms:
NR1F3 Nuclear receptor ROR-gamma (RORC) RAR-related orphan receptor C (RORc) RORG RZRG Retinoid-related orphan receptor-gamma (RORc)
Type:
Enzyme Catalytic Domain
Mol. Mass.:
58218.40
Organism:
Homo sapiens (Human)
Description:
P51449
Residue:
518
  
Inhibitor
Name:
BDBM416456
Synonyms:
(R)-N-(2-amino-1-(4-(ethylsulfonyl)phenyl)ethyl)-1-ethyl-2-(4-(trifluoromethyl)phenoxy)-1H-benzo[d]imidazole-5-carboxamide US10829448, Compound BE-11
Type:
Small organic molecule
Emp. Form.:
C27H27F3N4O4S
Mol. Mass.:
560.588
SMILES:
CCn1c(Oc2ccc(cc2)C(F)(F)F)nc2cc(ccc12)C(=O)N[C@@H](CN)c1ccc(cc1)S(=O)(=O)CC
: