Target
Nuclear receptor ROR-gamma
Ligand
BDBM416467
Substrate
Meas. Tech.
Radio-Ligand RORgamma Binding Assay (Assay 1)
Ki
<100±n/a nM
Citation
 Claremon, DADillard, LWFan, YLotesta, SDSingh, SBTice, CMZhao, WZhuang, L Substituted indoles as modulators of ROR-gamma US Patent  US10301261 Publication Date 5/28/2019 
Target
Name:
Nuclear receptor ROR-gamma
Synonyms:
NR1F3 Nuclear receptor ROR-gamma (RORC) RAR-related orphan receptor C (RORc) RORG RZRG Retinoid-related orphan receptor-gamma (RORc)
Type:
Enzyme Catalytic Domain
Mol. Mass.:
58218.40
Organism:
Homo sapiens (Human)
Description:
P51449
Residue:
518
  
Inhibitor
Name:
BDBM416467
Synonyms:
1-ethyl-N-(4-(ethylsulfonyl)benzyl)-2-(((1r,4r)-4-(trifluoromethyl)cyclohexyl)methyl)-1H-benzo[d]imidazole-5-carboxamide | US10301261, Compound BE-20
Type:
Small organic molecule
Emp. Form.:
C27H32F3N3O3S
Mol. Mass.:
535.621
SMILES:
CCn1c(C[C@H]2CC[C@@H](CC2)C(F)(F)F)nc2cc(ccc12)C(=O)NCc1ccc(cc1)S(=O)(=O)CC
: