Target
Serine/threonine-protein kinase/endoribonuclease IRE1
Ligand
BDBM50013808
Substrate
Meas. Tech.
FRET-suppression assay
IC50
16210±n/a nM
Citation
 Del Valle, JRHu, CA Inhibitors of the IRE-1/XBP-1 pathway and methods of using thereof US Patent  US10323013 Publication Date 6/18/2019 
Target
Name:
Serine/threonine-protein kinase/endoribonuclease IRE1
Synonyms:
ERN1 Endoplasmic reticulum-to-nucleus signaling 1 IRE1 Inositol requiring enzyme 1 (IRE-1alpha) Inositol-requiring protein 1 Ire1-alpha Serine/threonine-protein kinase/endoribonuclease IRE1 hIRE1p
Type:
Enzyme
Mol. Mass.:
109731.20
Organism:
Homo sapiens (Human)
Description:
O75460
Residue:
977
  
Inhibitor
Name:
BDBM50013808
Synonyms:
CHEMBL3265265 | US10323013, Compound 25
Type:
Small organic molecule
Emp. Form.:
C20H21NO5S2
Mol. Mass.:
419.514
SMILES:
Oc1ccc2c3CCN(Cc3c(=O)oc2c1C1SCCCS1)C(=O)OCC=C
: