Target
Plasma kallikrein
Ligand
BDBM416782
Substrate
Meas. Tech.
Plasma Kallikrein Activity Assay
Ki
25.1±n/a nM
Citation
 Kotian, PLBabu, YSWu, MChintareddy, VRKumar, VSZhang, W Human plasma kallikrein inhibitors US Patent  US10329260 Publication Date 6/25/2019 
Target
Name:
Plasma kallikrein
Synonyms:
Fletcher factor KLKB1 Kallikrein Plasma kallikrein heavy chain Plasma prekallikrein
Type:
Protein
Mol. Mass.:
71391.16
Organism:
Homo sapiens (Human)
Description:
P03952
Residue:
638
  
Inhibitor
Name:
BDBM416782
Synonyms:
1-(3-(Aminomethyl)phenyl)-N-(3-((cyclopropylmethylamino)(3-methoxyphenyl)methyl)phenyl)-3-(trifluoromethyl)-1H-pyrazole-5-carboxamide US10633345, Compound 109f US11203574, Compound 109f US11685721, Compound 109f | US11708332, Compound 109f
Type:
Small organic molecule
Emp. Form.:
C30H30F3N5O2
Mol. Mass.:
549.5867
SMILES:
COc1cccc(c1)C(NCC1CC1)c1cccc(NC(=O)c2cc(nn2-c2cccc(CN)c2)C(F)(F)F)c1
: