Target
Plasma kallikrein
Ligand
BDBM417023
Substrate
Meas. Tech.
Plasma Kallikrein Activity Assay
Ki
25.1±n/a nM
Citation
 Kotian, PLBabu, YSWu, MChintareddy, VRKumar, VSZhang, W Human plasma kallikrein inhibitors US Patent  US10329260 Publication Date 6/25/2019 
Target
Name:
Plasma kallikrein
Synonyms:
Fletcher factor KLKB1 Kallikrein Plasma kallikrein heavy chain Plasma prekallikrein
Type:
Protein
Mol. Mass.:
71391.16
Organism:
Homo sapiens (Human)
Description:
P03952
Residue:
638
  
Inhibitor
Name:
BDBM417023
Synonyms:
(+)-N-(5-(1-amino-1-(4-carbamoylphenyl)-3-cyclopropylpropyl)-2-fluorophenyl)-1-(3-(aminomethyl)phenyl)-3-(trifluoromethyl)-1H-pyrazole-5-carboxamide US10633345, Compound 228a US11203574, Compound 228a US11685721, Compound 228a | US11708332, Compound 228a
Type:
Small organic molecule
Emp. Form.:
C31H30F4N6O2
Mol. Mass.:
594.6025
SMILES:
NCc1cccc(c1)-n1nc(cc1C(=O)Nc1cc(ccc1F)C(N)(CCC1CC1)c1ccc(cc1)C(N)=O)C(F)(F)F
: