Target
Phosphatidylinositol 4,5-bisphosphate 3-kinase catalytic subunit delta isoform
Ligand
BDBM295682
Substrate
Meas. Tech.
p110alpha (Alpha) PI3K Binding Assay
Ki
24.1±n/a nM
Citation
 Braun, MHanan, EStaben, STHeald, RAMacLeod, CElliott, R Benzoxazepin oxazolidinone compounds and methods of use US Patent  US10112932 Publication Date 10/30/2018 
Target
Name:
Phosphatidylinositol 4,5-bisphosphate 3-kinase catalytic subunit delta isoform
Synonyms:
PI3-kinase p110 subunit delta PI3-kinase subunit p110-delta PIK3CD Phosphatidylinositol 4,5-biphosphate 3-kinase catalytic subunit delta (PIK3CD) Phosphatidylinositol 4,5-bisphosphate 3-kinase 110 kDa catalytic subunit delta (PI3K delta) Phosphatidylinositol 4,5-bisphosphate 3-kinase catalytic subunit delta (PI3Kdelta) Phosphatidylinositol 4,5-bisphosphate 3-kinase catalytic subunit delta isoform (PI3K delta) Phosphatidylinositol 4,5-bisphosphate 3-kinase catalytic subunit delta isoform (PI3K-delta) Phosphatidylinositol 4,5-bisphosphate 3-kinase catalytic subunit delta isoform (PI3Kdelta)
Type:
Enzyme Subunit
Mol. Mass.:
119489.41
Organism:
Homo sapiens (Human)
Description:
O00329
Residue:
1044
  
Inhibitor
Name:
BDBM295682
Synonyms:
US10851091, U.S. Pat. No. 8,242,104 No. 540 | US8242104, Compound 540
Type:
Small organic molecule
Emp. Form.:
C17H18N6O3
Mol. Mass.:
354.3632
SMILES:
C[C@H](Oc1ccc2-c3nc(cn3CCOc2c1)-c1ncnn1C)C(N)=O
: