Target
Neuronal acetylcholine receptor subunit alpha-7
Ligand
BDBM397113
Substrate
Meas. Tech.
Measurement of Human α7 Nicotinic Acetylcholine Receptor (nAChR)'s Activity
EC50
300±n/a nM
Citation
 Maeng, CYJang, YKCha, SBShin, HWJoung, CMYi, EJ Pharmaceutical composition comprising pyridone derivatives US Patent  US10456385 Publication Date 10/29/2019 
Target
Name:
Neuronal acetylcholine receptor subunit alpha-7
Synonyms:
ACHA7_HUMAN Cholinergic, Nicotinic Alpha7 Neuronal acetylcholine receptor protein alpha-7 subunit Nicotinic acetylcholine receptor alpha-7 (alpha7 nAChR)
Type:
Mol. Mass.:
56448.33
Organism:
Homo sapiens (Human)
Description:
CHRNA7 (NACHRA7)
Residue:
502
  
Inhibitor
Name:
BDBM397113
Synonyms:
N-[(3S)-1-azabicyclo[2.2.2]octan-3-yl)-6-oxo-1-(2-thiazolyl)-3-pyridinecarboxamide US9987259, Example 3
Type:
Small organic molecule
Emp. Form.:
C16H18N4O2S
Mol. Mass.:
330.405
SMILES:
O=C(N[C@@H]1CN2CCC1CC2)c1ccc(=O)n(c1)-c1nccs1
: