Target
Neuronal acetylcholine receptor subunit alpha-7
Ligand
BDBM397116
Substrate
Meas. Tech.
Measurement of Human α7 Nicotinic Acetylcholine Receptor (nAChR)'s Activity
EC50
>1000±n/a nM
Citation
 Maeng, CYJang, YKCha, SBShin, HWJoung, CMYi, EJ Pharmaceutical composition comprising pyridone derivatives US Patent  US10456385 Publication Date 10/29/2019 
Target
Name:
Neuronal acetylcholine receptor subunit alpha-7
Synonyms:
ACHA7_HUMAN Cholinergic, Nicotinic Alpha7 Neuronal acetylcholine receptor protein alpha-7 subunit Nicotinic acetylcholine receptor alpha-7 (alpha7 nAChR)
Type:
Mol. Mass.:
56448.33
Organism:
Homo sapiens (Human)
Description:
CHRNA7 (NACHRA7)
Residue:
502
  
Inhibitor
Name:
BDBM397116
Synonyms:
N-(1-azabicyclo[2.2.2]octan-3-yl)-6-oxo-1-[3-phenyl-5-isoxazolyl)-3-pyridinecarboxamide US9987259, Example 9
Type:
Small organic molecule
Emp. Form.:
C22H22N4O3
Mol. Mass.:
390.4351
SMILES:
O=C(NC1CN2CCC1CC2)c1ccc(=O)n(c1)-c1cc(no1)-c1ccccc1
: