Target
Neuronal acetylcholine receptor subunit alpha-7
Ligand
BDBM397136
Substrate
Meas. Tech.
Measurement of Human α7 Nicotinic Acetylcholine Receptor (nAChR)'s Activity
EC50
300±n/a nM
Citation
 Maeng, CYJang, YKCha, SBShin, HWJoung, CMYi, EJ Pharmaceutical composition comprising pyridone derivatives US Patent  US10456385 Publication Date 10/29/2019 
Target
Name:
Neuronal acetylcholine receptor subunit alpha-7
Synonyms:
ACHA7_HUMAN Cholinergic, Nicotinic Alpha7 Neuronal acetylcholine receptor protein alpha-7 subunit Nicotinic acetylcholine receptor alpha-7 (alpha7 nAChR)
Type:
Mol. Mass.:
56448.33
Organism:
Homo sapiens (Human)
Description:
CHRNA7 (NACHRA7)
Residue:
502
  
Inhibitor
Name:
BDBM397136
Synonyms:
N-(1-azabicyclo[2.2.2]octan-3-yl)-6-oxo-1-[5-(phenylmethyl)-2-thiazolyl)]-3-pyridine carboxamide US9987259, Example 29
Type:
Small organic molecule
Emp. Form.:
C23H24N4O2S
Mol. Mass.:
420.527
SMILES:
O=C(NC1CN2CCC1CC2)c1ccc(=O)n(c1)-c1ncc(Cc2ccccc2)s1
: