Target
Neuronal acetylcholine receptor subunit alpha-7
Ligand
BDBM397140
Substrate
Meas. Tech.
Measurement of Human α7 Nicotinic Acetylcholine Receptor (nAChR)'s Activity
EC50
>1000±n/a nM
Citation
 Maeng, CYJang, YKCha, SBShin, HWJoung, CMYi, EJ Pharmaceutical composition comprising pyridone derivatives US Patent  US10456385 Publication Date 10/29/2019 
Target
Name:
Neuronal acetylcholine receptor subunit alpha-7
Synonyms:
ACHA7_HUMAN Cholinergic, Nicotinic Alpha7 Neuronal acetylcholine receptor protein alpha-7 subunit Nicotinic acetylcholine receptor alpha-7 (alpha7 nAChR)
Type:
Mol. Mass.:
56448.33
Organism:
Homo sapiens (Human)
Description:
CHRNA7 (NACHRA7)
Residue:
502
  
Inhibitor
Name:
BDBM397140
Synonyms:
(1-azabicyclo[2.2.2]octan-3-yl)-1-[5-methyl-1,3-thiadiazole-2-yl)-6-oxo-3-pyridinecarboxylate US9987259, Example 45
Type:
Small organic molecule
Emp. Form.:
C17H19N3O3S
Mol. Mass.:
345.416
SMILES:
Cc1cnc(s1)-n1cc(ccc1=O)C(=O)OC1CN2CCC1CC2
: