Target
Tyrosine-protein kinase BTK
Ligand
BDBM259408
Substrate
Meas. Tech.
Inhibition of Btk Enzymatic Activity
IC50
42.0±n/a nM
Citation
 Angst, DGessier, FVulpetti, A Amino pyrimidine derivatives US Patent  US10457647 Publication Date 10/29/2019 
Target
Name:
Tyrosine-protein kinase BTK
Synonyms:
AGMX1 Agammaglobulinaemia tyrosine kinase B cell progenitor kinase BPK BTK_HUMAN Tyrosine Kinase BTK Tyrosine-protein kinase BTK (BTK)
Type:
Enzyme
Mol. Mass.:
76289.95
Organism:
Homo sapiens (Human)
Description:
Q06187
Residue:
659
  
Inhibitor
Name:
BDBM259408
Synonyms:
US10457647, Example 7 US11673868, Example 7 | US9512084, 7
Type:
Small organic molecule
Emp. Form.:
C28H29F2N5O3
Mol. Mass.:
521.5584
SMILES:
C\C=C\C(=O)N(C)CCOc1c(N)ncnc1-c1cc(F)cc(NC(=O)c2ccc(cc2F)C2CC2)c1C
: