Target
Cannabinoid receptor 1
Ligand
BDBM295663
Substrate
Meas. Tech.
CB1 cAMP (Assay 2)
EC50
104000±n/a nM
Citation
 Riether, DBinder, FPDoods, HMueller, SGNicholson, JRSauer, A (Cyano-dimethyl-methyl)-isoxazoles and -[1,3,4]thiadiazoles US Patent  US10112934 Publication Date 10/30/2018 
Target
Name:
Cannabinoid receptor 1
Synonyms:
CANN6 CB-R CNR CNR1_HUMAN Cannabinoid receptor Cannabinoid receptor 1 (brain)
Type:
G Protein-Coupled Receptor (GPCR)
Mol. Mass.:
52868.96
Organism:
Homo sapiens (Human)
Description:
P21554
Residue:
472
  
Inhibitor
Name:
BDBM295663
Synonyms:
US10112934, Example 1
Type:
Small organic molecule
Emp. Form.:
C16H23F2N3O4S
Mol. Mass.:
391.433
SMILES:
CC(F)(F)CCCS(=O)(=O)C(C)(C)C(=O)Nc1cc(no1)C(C)(C)C#N
: