Target
Cannabinoid receptor 1
Ligand
BDBM295692
Substrate
Meas. Tech.
CB1 cAMP (Assay 2)
EC50
200000±n/a nM
Citation
 Riether, DBinder, FPDoods, HMueller, SGNicholson, JRSauer, A (Cyano-dimethyl-methyl)-isoxazoles and -[1,3,4]thiadiazoles US Patent  US10112934 Publication Date 10/30/2018 
Target
Name:
Cannabinoid receptor 1
Synonyms:
CANN6 CB-R CNR CNR1_HUMAN Cannabinoid receptor Cannabinoid receptor 1 (brain)
Type:
G Protein-Coupled Receptor (GPCR)
Mol. Mass.:
52868.96
Organism:
Homo sapiens (Human)
Description:
P21554
Residue:
472
  
Inhibitor
Name:
BDBM295692
Synonyms:
Example 133 in WO2010036630 US11084810, Example 133 | US11725004, Example 133
Type:
Small organic molecule
Emp. Form.:
C15H24N2O6S
Mol. Mass.:
360.426
SMILES:
CC(C)(O)c1cc(NC(=O)C(C)(C)S(=O)(=O)C2CCOCC2)on1
: