Target
Cannabinoid receptor 1
Ligand
BDBM295695
Substrate
Meas. Tech.
CB1 cAMP (Assay 2)
EC50
45.0±n/a nM
Citation
 Riether, DBinder, FPDoods, HMueller, SGNicholson, JRSauer, A (Cyano-dimethyl-methyl)-isoxazoles and -[1,3,4]thiadiazoles US Patent  US10112934 Publication Date 10/30/2018 
Target
Name:
Cannabinoid receptor 1
Synonyms:
CANN6 CB-R CNR CNR1_HUMAN Cannabinoid receptor Cannabinoid receptor 1 (brain)
Type:
G Protein-Coupled Receptor (GPCR)
Mol. Mass.:
52868.96
Organism:
Homo sapiens (Human)
Description:
P21554
Residue:
472
  
Inhibitor
Name:
BDBM295695
Synonyms:
Example 7 in WO2010147792 US11725004, Example 7 in WO2010147792
Type:
Small organic molecule
Emp. Form.:
C18H31N3O4
Mol. Mass.:
353.4564
SMILES:
CN(CC1CCOCC1)C(C)(C)C(=O)Nc1cc(no1)C(C)(C)CO
: