Target
Cannabinoid receptor 2
Ligand
BDBM295700
Substrate
Meas. Tech.
CB2 cAMP (Assay 1)
EC50
25.0±n/a nM
Citation
 Riether, DBinder, FPDoods, HMueller, SGNicholson, JRSauer, A (Cyano-dimethyl-methyl)-isoxazoles and -[1,3,4]thiadiazoles US Patent  US10112934 Publication Date 10/30/2018 
Target
Name:
Cannabinoid receptor 2
Synonyms:
CANNABINOID CB2 CB2 CB2B CNR2_HUMAN Cannabinoid CB2 receptor Cannabinoid receptor 2 (CB2R) | hCB2
Type:
G Protein-Coupled Receptor (GPCR)
Mol. Mass.:
39690.94
Organism:
Homo sapiens (Human)
Description:
P34972
Residue:
360
  
Inhibitor
Name:
BDBM295700
Synonyms:
US10112934, Example 7 US11725004, Example 7
Type:
Small organic molecule
Emp. Form.:
C17H27N5O2S
Mol. Mass.:
365.494
SMILES:
CN(CC1CCOCC1)C(C)(C)C(=O)Nc1nnc(s1)C(C)(C)C#N
: