Target
Cannabinoid receptor 1
Ligand
BDBM295701
Substrate
Meas. Tech.
CB1 cAMP (Assay 2)
EC50
120000±n/a nM
Citation
 Riether, DBinder, FPDoods, HMueller, SGNicholson, JRSauer, A (Cyano-dimethyl-methyl)-isoxazoles and -[1,3,4]thiadiazoles US Patent  US10112934 Publication Date 10/30/2018 
Target
Name:
Cannabinoid receptor 1
Synonyms:
CANN6 CB-R CNR CNR1_HUMAN Cannabinoid receptor Cannabinoid receptor 1 (brain)
Type:
G Protein-Coupled Receptor (GPCR)
Mol. Mass.:
52868.96
Organism:
Homo sapiens (Human)
Description:
P21554
Residue:
472
  
Inhibitor
Name:
BDBM295701
Synonyms:
Example 30 in WO2010147792 US11084810, Example 30 in WO2010147792 | US11725004, Example 30 in WO2010147792
Type:
Small organic molecule
Emp. Form.:
C17H30N4O3S
Mol. Mass.:
370.51
SMILES:
CN(CC1CCOCC1)C(C)(C)C(=O)Nc1nnc(s1)C(C)(C)CO
: