Target
Cannabinoid receptor 1
Ligand
BDBM295702
Substrate
Meas. Tech.
CB1 cAMP (Assay 2)
EC50
69000±n/a nM
Citation
 Riether, DBinder, FPDoods, HMueller, SGNicholson, JRSauer, A (Cyano-dimethyl-methyl)-isoxazoles and -[1,3,4]thiadiazoles US Patent  US10112934 Publication Date 10/30/2018 
Target
Name:
Cannabinoid receptor 1
Synonyms:
CANN6 CB-R CNR CNR1_HUMAN Cannabinoid receptor Cannabinoid receptor 1 (brain)
Type:
G Protein-Coupled Receptor (GPCR)
Mol. Mass.:
52868.96
Organism:
Homo sapiens (Human)
Description:
P21554
Residue:
472
  
Inhibitor
Name:
BDBM295702
Synonyms:
US10112934, Example 8 US11084810, Example 8 | US11725004, Example 8
Type:
Small organic molecule
Emp. Form.:
C17H28N6O3S2
Mol. Mass.:
428.573
SMILES:
CN(C1CCN(CC1)S(C)(=O)=O)C(C)(C)C(=O)Nc1nnc(s1)C(C)(C)C#N
: