Target
Vascular endothelial growth factor receptor 2
Ligand
BDBM50363397
Substrate
Meas. Tech.
In-Vitro Kinase Inhibition Assay
Ki
4.20±n/a nM
Citation
 Horn, G Multi-tyrosine kinase inhibitors derivatives and methods of use US Patent  US10464902 Publication Date 11/5/2019 
Target
Name:
Vascular endothelial growth factor receptor 2
Synonyms:
CD_antigen=CD309 Fetal liver kinase 1 (FLK-1) KDR Protein-tyrosine kinase receptor Flk-1 VEGFR-2 VEGFR2 Vascular Endothelial Growth Factor Receptor Kinase 2 Vascular endothelial growth factor receptor 2 (KDR) Vascular endothelial growth factor receptor 2 (VEGFR2) Vascular endothelial growth factor receptor-2 (VEGFR-2)
Type:
Receptor Tyrosine Kinase
Mol. Mass.:
151510.97
Organism:
Homo sapiens (Human)
Description:
P35968
Residue:
1356
  
Inhibitor
Name:
BDBM50363397
Synonyms:
CHEMBL1946170 US10183928, Regorafenib US10227329, Compound Regorafenib US10584114, Compound Regorafenib US11279688, Compound Regorafenib
Type:
Small organic molecule
Emp. Form.:
C21H15ClF4N4O3
Mol. Mass.:
482.815
SMILES:
CNC(=O)c1cc(Oc2ccc(NC(=O)Nc3ccc(Cl)c(c3)C(F)(F)F)c(F)c2)ccn1
: