Target
Cyclin-dependent kinase 4
Ligand
BDBM419855
Substrate
Meas. Tech.
Caliper Mobility Shift Assay
IC50
<20±n/a nM
Citation
 Zheng, YJin, HZhou, FHuang, MMeng, X 2,4-disubstituted pyrimidines as CDK inhibitors US Patent  US10464927 Publication Date 11/5/2019 
Target
Name:
Cyclin-dependent kinase 4
Synonyms:
CDK4 Cell division protein kinase 4 PSK-J3
Type:
Enzyme Subunit
Mol. Mass.:
33731.96
Organism:
Homo sapiens (Human)
Description:
P11802
Residue:
303
  
Inhibitor
Name:
BDBM419855
Synonyms:
US10464927, Compound I-3
Type:
Small organic molecule
Emp. Form.:
C28H30FN7O
Mol. Mass.:
499.5825
SMILES:
CC(=O)c1cn(C2CCCC2)c2ccc(cc12)-c1nc(Nc2ccc(cn2)N2CCNCC2)ncc1F
: