Target
Bromodomain-containing protein 4 [342-460]
Ligand
BDBM318463
Substrate
Meas. Tech.
AlphaScreen Assay A1
IC50
<100±n/a nM
Citation
 Combs, APSparks, RBMaduskuie, Jr., TPRodgers, JD Tricyclic heterocycles as BET protein inhibitors US Patent  US10464947 Publication Date 11/5/2019 
Target
Name:
Bromodomain-containing protein 4 [342-460]
Synonyms:
BRD4 BRD4_HUMAN Bromodomain-containing protein 4 (BRD4)(BD2) | HUNK1
Type:
Enzyme Catalytic Domain
Mol. Mass.:
13783.81
Organism:
Homo sapiens (Human)
Description:
a.a. 342-460 (BRD4-BD2)
Residue:
119
  
Inhibitor
Name:
BDBM318463
Synonyms:
7-(3,5-Dimethylisoxazol-4-yl)-4-(2,4-difluorophenyl)-4,5-dihydroimidazo[1,5,4-de][1,4]benzoxazin-2(1H)-one US11498926, Example 8 | US9624241, Example 8
Type:
Small organic molecule
Emp. Form.:
C20H15F2N3O3
Mol. Mass.:
383.3482
SMILES:
Cc1noc(C)c1-c1ccc2[nH]c(=O)n3C(COc1c23)c1ccc(F)cc1F
: