Target
Bromodomain-containing protein 4 [42-168]
Ligand
BDBM318480
Substrate
Meas. Tech.
AlphaScreen Assay A1
IC50
<100±n/a nM
Citation
 Combs, APSparks, RBMaduskuie, Jr., TPRodgers, JD Tricyclic heterocycles as BET protein inhibitors US Patent  US10464947 Publication Date 11/5/2019 
Target
Name:
Bromodomain-containing protein 4 [42-168]
Synonyms:
BRD4 BRD4_HUMAN HUNK1
Type:
Enzyme Catalytic Domain
Mol. Mass.:
15054.68
Organism:
Homo sapiens (Human)
Description:
O60885[42-168]
Residue:
127
  
Inhibitor
Name:
BDBM318480
Synonyms:
7-(3,5-Dimethylisoxazol-4-yl)-N-methyl-4-phenyl-4,5-dihydroimidazo[1,5,4-de][1,4]benzoxazin-2-amine US11498926, Example 26 | US9624241, Example 26
Type:
Small organic molecule
Emp. Form.:
C21H20N4O2
Mol. Mass.:
360.4091
SMILES:
CNc1nc2ccc(-c3c(C)noc3C)c3OCC(c4ccccc4)n1c23
: